Reaction Details
TargetPeroxisome proliferator-activated receptor alpha
LigandBDBM50349811
Substrate/Competitorn/a
Meas. Tech.ChEMBL_760320 (CHEMBL1815135)
EC50 0.1±n/a nM
Citation Raval, PJain, MGoswami, ABasu, SGite, AGodha, APingali, HRaval, SGiri, SSuthar, DShah, MPatel, P Revisiting glitazars: thiophene substituted oxazole containinga-ethoxy phenylpropanoic acid derivatives as highly potent PPARa/¿ dual agonists devoid of adverse effects in rodents. Bioorg Med Chem Lett21:3103-9 (2011) 
 
Peroxisome proliferator-activated receptor alpha
Name:Peroxisome proliferator-activated receptor alpha
Type:Enzyme
Mol. Mass.:52222.08
Organism:Homo sapiens (Human)
Description:Q07869
Residue:468
BDBM50349811
NameBDBM50349811
Synonyms:CHEMBL1813008
TypeSmall organic molecule
Emp. Form.C21H23NO5S
Mol. Mass.401.476
SMILESCCO[C@@H](Cc1ccc(OCCc2nc(oc2C)-c2cccs2)cc1)C(O)=O