Reaction Details
TargetPeroxisome proliferator-activated receptor gamma
LigandBDBM50349816
Substrate/Competitorn/a
Meas. Tech.ChEMBL_760322 (CHEMBL1815137)
EC50 0.6±n/a nM
Citation Raval, PJain, MGoswami, ABasu, SGite, AGodha, APingali, HRaval, SGiri, SSuthar, DShah, MPatel, P Revisiting glitazars: thiophene substituted oxazole containinga-ethoxy phenylpropanoic acid derivatives as highly potent PPARa/¿ dual agonists devoid of adverse effects in rodents. Bioorg Med Chem Lett21:3103-9 (2011) 
 
Peroxisome proliferator-activated receptor gamma
Name:Peroxisome proliferator-activated receptor gamma
Type:Nuclear Receptor
Mol. Mass.:57613.46
Organism:Homo sapiens (Human)
Description:P37231
Residue:505
BDBM50349816
NameBDBM50349816
Synonyms:CHEMBL1813009
TypeSmall organic molecule
Emp. Form.C21H23NO5S
Mol. Mass.401.476
SMILESCCO[C@@H](Cc1ccc(OCCc2nc(oc2C)-c2ccsc2)cc1)C(O)=O