Reaction Details
TargetPolyphenol oxidase 2
LigandBDBM50349826
Substrate/Competitorn/a
Meas. Tech.ChEMBL_760491 (CHEMBL1815476)
IC50>1000000±n/a nM
Citation Yu, LLHu, WCDing, GLi, RTWei, JHZou, ZMWang, MH Gusanlungionosides A-D, potential tyrosinase inhibitors from Arcangelisia gusanlung. J Nat Prod74:1009-14 (2011) 
 
Polyphenol oxidase 2
Name:Polyphenol oxidase 2
Type:Protein
Mol. Mass.:63923.66
Organism:Agaricus bisporus (Common mushroom)
Description:O42713
Residue:556
BDBM50349826
NameBDBM50349826
Synonyms:SYRINGARESINOL
TypeSmall organic molecule
Emp. Form.C22H26O8
Mol. Mass.418.437
SMILESCOc1cc(cc(OC)c1O)[C@H]1OC[C@H]2[C@@H]1CO[C@@H]2c1cc(OC)c(O)c(OC)c1