Reaction Details
TargetCarbonic anhydrase 14
LigandBDBM50349850
Substrate/Competitorn/a
Meas. Tech.ChEMBL_760550 (CHEMBL1815535)
Ki 3.8±n/a nM
Citation Carta, FGaraj, VMaresca, AWagner, JAvvaru, BSRobbins, AHScozzafava, AMcKenna, RSupuran, CT Sulfonamides incorporating 1,3,5-triazine moieties selectively and potently inhibit carbonic anhydrase transmembrane isoforms IX, XII and XIV over cytosolic isoforms I and II: Solution and X-ray crystallographic studies. Bioorg Med Chem19:3105-19 (2011) 
 
Carbonic anhydrase 14
Name:Carbonic anhydrase 14
Type:Enzyme
Mol. Mass.:37665.67
Organism:Homo sapiens (Human)
Description:Human (cloned) isozyme.
Residue:337
BDBM50349850
NameBDBM50349850
Synonyms:CHEMBL1738787
TypeSmall organic molecule
Emp. Form.C11H13ClN6O3S
Mol. Mass.344.777
SMILESNS(=O)(=O)c1ccc(Nc2nc(Cl)nc(NCCO)n2)cc1