Reaction Details
TargetCarbonic anhydrase 14
LigandBDBM50349855
Substrate/Competitorn/a
Meas. Tech.ChEMBL_760550 (CHEMBL1815535)
Ki 77±n/a nM
Citation Carta, FGaraj, VMaresca, AWagner, JAvvaru, BSRobbins, AHScozzafava, AMcKenna, RSupuran, CT Sulfonamides incorporating 1,3,5-triazine moieties selectively and potently inhibit carbonic anhydrase transmembrane isoforms IX, XII and XIV over cytosolic isoforms I and II: Solution and X-ray crystallographic studies. Bioorg Med Chem19:3105-19 (2011) 
 
Carbonic anhydrase 14
Name:Carbonic anhydrase 14
Type:Enzyme
Mol. Mass.:37665.67
Organism:Homo sapiens (Human)
Description:Human (cloned) isozyme.
Residue:337
BDBM50349855
NameBDBM50349855
Synonyms:CHEMBL1813217
TypeSmall organic molecule
Emp. Form.C20H21ClN6O6S
Mol. Mass.508.935
SMILESNS(=O)(=O)c1ccc(CCNc2nc(Cl)nc(NC(Cc3ccc(O)c(O)c3)C(O)=O)n2)cc1