Reaction Details
TargetCarbonic anhydrase 14
LigandBDBM50349856
Substrate/Competitorn/a
Meas. Tech.ChEMBL_760550 (CHEMBL1815535)
Ki 8.8±n/a nM
Citation Carta, FGaraj, VMaresca, AWagner, JAvvaru, BSRobbins, AHScozzafava, AMcKenna, RSupuran, CT Sulfonamides incorporating 1,3,5-triazine moieties selectively and potently inhibit carbonic anhydrase transmembrane isoforms IX, XII and XIV over cytosolic isoforms I and II: Solution and X-ray crystallographic studies. Bioorg Med Chem19:3105-19 (2011) 
 
Carbonic anhydrase 14
Name:Carbonic anhydrase 14
Type:Enzyme
Mol. Mass.:37665.67
Organism:Homo sapiens (Human)
Description:Human (cloned) isozyme.
Residue:337
BDBM50349856
NameBDBM50349856
Synonyms:CHEMBL1813218
TypeSmall organic molecule
Emp. Form.C17H23N7O6S
Mol. Mass.453.473
SMILESCC(Nc1nc(NCCc2ccc(cc2)S(N)(=O)=O)nc(NC(C)C(O)=O)n1)C(O)=O