Reaction Details
TargetCarbonic anhydrase 13
LigandBDBM50167327
Substrate/Competitorn/a
Meas. Tech.ChEMBL_760556 (CHEMBL1815541)
Ki 62±n/a nM
Citation Carta, FGaraj, VMaresca, AWagner, JAvvaru, BSRobbins, AHScozzafava, AMcKenna, RSupuran, CT Sulfonamides incorporating 1,3,5-triazine moieties selectively and potently inhibit carbonic anhydrase transmembrane isoforms IX, XII and XIV over cytosolic isoforms I and II: Solution and X-ray crystallographic studies. Bioorg Med Chem19:3105-19 (2011) 
 
Carbonic anhydrase 13
Name:Carbonic anhydrase 13
Type:Enzyme
Mol. Mass.:29445.78
Organism:Homo sapiens (Human)
Description:Q8N1Q1
Residue:262
BDBM50167327
NameBDBM50167327
Synonyms:CHEMBL191045 | [4-Chloro-6-(4-sulfamoyl-benzylamino)-[1,3,5]triazin-2-ylamino]-acetic acid
TypeSmall organic molecule
Emp. Form.C12H13ClN6O4S
Mol. Mass.372.787
SMILESNS(=O)(=O)c1ccc(CNc2nc(Cl)nc(NCC(O)=O)n2)cc1