Reaction Details
TargetCarbonic anhydrase 9
LigandBDBM50153973
Substrate/Competitorn/a
Meas. Tech.ChEMBL_760548 (CHEMBL1815533)
Ki 138±n/a nM
Citation Carta, FGaraj, VMaresca, AWagner, JAvvaru, BSRobbins, AHScozzafava, AMcKenna, RSupuran, CT Sulfonamides incorporating 1,3,5-triazine moieties selectively and potently inhibit carbonic anhydrase transmembrane isoforms IX, XII and XIV over cytosolic isoforms I and II: Solution and X-ray crystallographic studies. Bioorg Med Chem19:3105-19 (2011) 
 
Carbonic anhydrase 9
Name:Carbonic anhydrase 9
Type:Enzyme
Mol. Mass.:49669.03
Organism:Homo sapiens (Human)
Description:Catalytic domain of human cloned isozyme was used in the assay
Residue:459
BDBM50153973
NameBDBM50153973
Synonyms:4-[2-(4,6-Dichloro-[1,3,5]triazin-2-ylamino)-ethyl]-benzenesulfonamide | CHEMBL187274
TypeSmall organic molecule
Emp. Form.C11H11Cl2N5O2S
Mol. Mass.348.208
SMILESNS(=O)(=O)c1ccc(CCNc2nc(Cl)nc(Cl)n2)cc1