Reaction Details
TargetCarbonic anhydrase 9
LigandBDBM50349844
Substrate/Competitorn/a
Meas. Tech.ChEMBL_760548 (CHEMBL1815533)
Ki 8.5±n/a nM
Citation Carta, FGaraj, VMaresca, AWagner, JAvvaru, BSRobbins, AHScozzafava, AMcKenna, RSupuran, CT Sulfonamides incorporating 1,3,5-triazine moieties selectively and potently inhibit carbonic anhydrase transmembrane isoforms IX, XII and XIV over cytosolic isoforms I and II: Solution and X-ray crystallographic studies. Bioorg Med Chem19:3105-19 (2011) 
 
Carbonic anhydrase 9
Name:Carbonic anhydrase 9
Type:Enzyme
Mol. Mass.:49669.03
Organism:Homo sapiens (Human)
Description:Catalytic domain of human cloned isozyme was used in the assay
Residue:459
BDBM50349844
NameBDBM50349844
Synonyms:CHEMBL1813214
TypeSmall organic molecule
Emp. Form.C16H21N7O6S
Mol. Mass.439.446
SMILESCC(Nc1nc(NCc2ccc(cc2)S(N)(=O)=O)nc(NC(C)C(O)=O)n1)C(O)=O