Reaction Details
TargetCarbonic anhydrase 9
LigandBDBM50167355
Substrate/Competitorn/a
Meas. Tech.ChEMBL_760548 (CHEMBL1815533)
Ki 1±n/a nM
Citation Carta, FGaraj, VMaresca, AWagner, JAvvaru, BSRobbins, AHScozzafava, AMcKenna, RSupuran, CT Sulfonamides incorporating 1,3,5-triazine moieties selectively and potently inhibit carbonic anhydrase transmembrane isoforms IX, XII and XIV over cytosolic isoforms I and II: Solution and X-ray crystallographic studies. Bioorg Med Chem19:3105-19 (2011) 
 
Carbonic anhydrase 9
Name:Carbonic anhydrase 9
Type:Enzyme
Mol. Mass.:49669.03
Organism:Homo sapiens (Human)
Description:Catalytic domain of human cloned isozyme was used in the assay
Residue:459
BDBM50167355
NameBDBM50167355
Synonyms:CHEMBL189526 | {4-Chloro-6-[2-(4-sulfamoyl-phenyl)-ethylamino]-[1,3,5]triazin-2-ylamino}-acetic acid
TypeSmall organic molecule
Emp. Form.C13H15ClN6O4S
Mol. Mass.386.814
SMILESNS(=O)(=O)c1ccc(CCNc2nc(Cl)nc(NCC(O)=O)n2)cc1