Reaction Details
TargetCarbonic anhydrase 12
LigandBDBM50153971
Substrate/Competitorn/a
Meas. Tech.ChEMBL_760549 (CHEMBL1815534)
Ki 0.35±n/a nM
Citation Carta, FGaraj, VMaresca, AWagner, JAvvaru, BSRobbins, AHScozzafava, AMcKenna, RSupuran, CT Sulfonamides incorporating 1,3,5-triazine moieties selectively and potently inhibit carbonic anhydrase transmembrane isoforms IX, XII and XIV over cytosolic isoforms I and II: Solution and X-ray crystallographic studies. Bioorg Med Chem19:3105-19 (2011) 
 
Carbonic anhydrase 12
Name:Carbonic anhydrase 12
Type:Enzyme
Mol. Mass.:39456.00
Organism:Homo sapiens (Human)
Description:Catalytic domain of human cloned isozyme was used in the assay
Residue:354
BDBM50153971
NameBDBM50153971
Synonyms:4-(4,6-Dichloro-[1,3,5]triazin-2-ylamino)-benzenesulfonamide CHEMBL366069
TypeSmall organic molecule
Emp. Form.C9H7Cl2N5O2S
Mol. Mass.320.155
SMILESNS(=O)(=O)c1ccc(Nc2nc(Cl)nc(Cl)n2)cc1