Reaction Details
TargetCarbonic anhydrase 12
LigandBDBM50349843
Substrate/Competitorn/a
Meas. Tech.ChEMBL_760549 (CHEMBL1815534)
Ki 9.3±n/a nM
Citation Carta, FGaraj, VMaresca, AWagner, JAvvaru, BSRobbins, AHScozzafava, AMcKenna, RSupuran, CT Sulfonamides incorporating 1,3,5-triazine moieties selectively and potently inhibit carbonic anhydrase transmembrane isoforms IX, XII and XIV over cytosolic isoforms I and II: Solution and X-ray crystallographic studies. Bioorg Med Chem19:3105-19 (2011) 
 
Carbonic anhydrase 12
Name:Carbonic anhydrase 12
Type:Enzyme
Mol. Mass.:39456.00
Organism:Homo sapiens (Human)
Description:Catalytic domain of human cloned isozyme was used in the assay
Residue:354
BDBM50349843
NameBDBM50349843
Synonyms:CHEMBL1813213
TypeSmall organic molecule
Emp. Form.C16H21N7O6S
Mol. Mass.439.446
SMILESCOC(=O)CNc1nc(NCC(=O)OC)nc(NCc2ccc(cc2)S(N)(=O)=O)n1