Reaction Details
TargetCarbonic anhydrase 12
LigandBDBM50349855
Substrate/Competitorn/a
Meas. Tech.ChEMBL_760549 (CHEMBL1815534)
Ki 82±n/a nM
Citation Carta, FGaraj, VMaresca, AWagner, JAvvaru, BSRobbins, AHScozzafava, AMcKenna, RSupuran, CT Sulfonamides incorporating 1,3,5-triazine moieties selectively and potently inhibit carbonic anhydrase transmembrane isoforms IX, XII and XIV over cytosolic isoforms I and II: Solution and X-ray crystallographic studies. Bioorg Med Chem19:3105-19 (2011) 
 
Carbonic anhydrase 12
Name:Carbonic anhydrase 12
Type:Enzyme
Mol. Mass.:39456.00
Organism:Homo sapiens (Human)
Description:Catalytic domain of human cloned isozyme was used in the assay
Residue:354
BDBM50349855
NameBDBM50349855
Synonyms:CHEMBL1813217
TypeSmall organic molecule
Emp. Form.C20H21ClN6O6S
Mol. Mass.508.935
SMILESNS(=O)(=O)c1ccc(CCNc2nc(Cl)nc(NC(Cc3ccc(O)c(O)c3)C(O)=O)n2)cc1