Reaction Details
TargetCarbonic anhydrase 1
LigandBDBM50349847
Substrate/Competitorn/a
Meas. Tech.ChEMBL_760546 (CHEMBL1815531)
Ki 673±n/a nM
Citation Carta, FGaraj, VMaresca, AWagner, JAvvaru, BSRobbins, AHScozzafava, AMcKenna, RSupuran, CT Sulfonamides incorporating 1,3,5-triazine moieties selectively and potently inhibit carbonic anhydrase transmembrane isoforms IX, XII and XIV over cytosolic isoforms I and II: Solution and X-ray crystallographic studies. Bioorg Med Chem19:3105-19 (2011) 
 
Carbonic anhydrase 1
Name:Carbonic anhydrase 1
Type:Enzyme
Mol. Mass.:28873.37
Organism:Homo sapiens (Human)
Description:P00915
Residue:261
BDBM50349847
NameBDBM50349847
Synonyms:CHEMBL1813208
TypeSmall organic molecule
Emp. Form.C15H19N7O6S
Mol. Mass.425.42
SMILESNS(=O)(=O)c1ccc(Nc2nc(NCCC(O)=O)nc(NCCC(O)=O)n2)cc1