Reaction Details
TargetCarbonic anhydrase 1
LigandBDBM50349848
Substrate/Competitorn/a
Meas. Tech.ChEMBL_760546 (CHEMBL1815531)
Ki 1324±n/a nM
Citation Carta, FGaraj, VMaresca, AWagner, JAvvaru, BSRobbins, AHScozzafava, AMcKenna, RSupuran, CT Sulfonamides incorporating 1,3,5-triazine moieties selectively and potently inhibit carbonic anhydrase transmembrane isoforms IX, XII and XIV over cytosolic isoforms I and II: Solution and X-ray crystallographic studies. Bioorg Med Chem19:3105-19 (2011) 
 
Carbonic anhydrase 1
Name:Carbonic anhydrase 1
Type:Enzyme
Mol. Mass.:28873.37
Organism:Homo sapiens (Human)
Description:P00915
Residue:261
BDBM50349848
NameBDBM50349848
Synonyms:CHEMBL1813209
TypeSmall organic molecule
Emp. Form.C12H13ClN6O4S
Mol. Mass.372.787
SMILESCC(Nc1nc(Cl)nc(Nc2ccc(cc2)S(N)(=O)=O)n1)C(O)=O