Reaction Details
TargetCarbonic anhydrase 1
LigandBDBM50349852
Substrate/Competitorn/a
Meas. Tech.ChEMBL_760546 (CHEMBL1815531)
Ki 3472±n/a nM
Citation Carta, FGaraj, VMaresca, AWagner, JAvvaru, BSRobbins, AHScozzafava, AMcKenna, RSupuran, CT Sulfonamides incorporating 1,3,5-triazine moieties selectively and potently inhibit carbonic anhydrase transmembrane isoforms IX, XII and XIV over cytosolic isoforms I and II: Solution and X-ray crystallographic studies. Bioorg Med Chem19:3105-19 (2011) 
 
Carbonic anhydrase 1
Name:Carbonic anhydrase 1
Type:Enzyme
Mol. Mass.:28873.37
Organism:Homo sapiens (Human)
Description:P00915
Residue:261
BDBM50349852
NameBDBM50349852
Synonyms:CHEMBL1813212
TypeSmall organic molecule
Emp. Form.C17H26ClN5O4SSi
Mol. Mass.460.023
SMILESCC(C)(C)[Si](C)(C)OCCOc1nc(Cl)nc(Nc2ccc(cc2)S(N)(=O)=O)n1