Reaction Details
TargetD(2) dopamine receptor
LigandBDBM50130293
Substrate/Competitorn/a
Meas. Tech.ChEMBL_760689 (CHEMBL1815674)
Ki 3.1±n/a nM
Citation Vangveravong, SZhang, ZTaylor, MBearden, MXu, JCui, JWang, WLuedtke, RRMach, RH Synthesis and characterization of selective dopamine D2 receptor ligands using aripiprazole as the lead compound. Bioorg Med Chem19:3502-11 (2011) 
 
D(2) dopamine receptor
Name:D(2) dopamine receptor
Type:Cell-surface receptors
Mol. Mass.:50647.10
Organism:Homo sapiens (Human)
Description:P14416
Residue:443
BDBM50130293
NameBDBM50130293
Synonyms:7-{4-[4-(2,3-dichlorophenyl)piperazin-1-yl]butoxy}-3,4-dihydroquinolin-2(1H)-one CHEMBL1112 US10752588, Compound Aripiprazole US9018213, aripprazole | US9156822, Aripiprazole
TypeSmall organic molecule
Emp. Form.C23H27Cl2N3O2
Mol. Mass.448.385
SMILESClc1cccc(N2CCN(CCCCOc3ccc4CCC(=O)Nc4c3)CC2)c1Cl