Reaction Details
TargetMu-type opioid receptor
LigandBDBM50349895
Substrate/Competitorn/a
Meas. Tech.ChEMBL_762060 (CHEMBL1816052)
Ki 1500±n/a nM
Citation Kim, JHDeschamps, JRRothman, RBDersch, CMFolk, JECheng, KJacobson, AERice, KC Probes for narcotic receptor mediated phenomena. Part 42: synthesis and in vitro pharmacological characterization of the N-methyl and N-phenethyl analogues of the racemic ortho-c and para-c oxide-bridged phenylmorphans. Bioorg Med Chem19:3434-43 (2011) 
 
Mu-type opioid receptor
Name:Mu-type opioid receptor
Type:G Protein-Coupled Receptor (GPCR)
Mol. Mass.:44789.51
Organism:Homo sapiens (Human)
Description:P35372
Residue:400
BDBM50349895
NameBDBM50349895
Synonyms:CHEMBL1814703
TypeSmall organic molecule
Emp. Form.C15H19NO2
Mol. Mass.245.3169
SMILESCN1C[C@H]2Oc3ccc(O)cc3[C@@]22CCC[C@@H]1C2