Reaction Details
TargetTyrosine-protein phosphatase non-receptor type 1
LigandBDBM50349925
Substrate/Competitorn/a
Meas. Tech.ChEMBL_762179 (CHEMBL1816250)
IC50 72900±n/a nM
Citation Nguyen, PHDao, TTKim, JPhong, do TNdinteh, DTMbafor, JTOh, WK New 5-deoxyflavonoids and their inhibitory effects on protein tyrosine phosphatase 1B (PTP1B) activity. Bioorg Med Chem19:3378-83 (2011) 
 
Tyrosine-protein phosphatase non-receptor type 1
Name:Tyrosine-protein phosphatase non-receptor type 1
Type:Protein phosphatase
Mol. Mass.:49963.76
Organism:Homo sapiens (Human)
Description:Human recombinant GST-fusion PTP1B (1-435).
Residue:435
BDBM50349925
NameBDBM50349925
Synonyms:CHEMBL454077
TypeSmall organic molecule
Emp. Form.C25H26O4
Mol. Mass.390.4715
SMILES[#6]\[#6](-[#6])=[#6]\[#6]-c1cc(cc2-[#6]=[#6]C([#6])([#6])[#8]-c12)-[#6@@H]-1-[#6]-[#6](=O)-c2ccc(-[#8])cc2-[#8]-1