Reaction Details
TargetTyrosine-protein phosphatase non-receptor type 1
LigandBDBM50241408
Substrate/Competitorn/a
Meas. Tech.ChEMBL_762179 (CHEMBL1816250)
IC50>100000±n/a nM
Citation Nguyen, PHDao, TTKim, JPhong, do TNdinteh, DTMbafor, JTOh, WK New 5-deoxyflavonoids and their inhibitory effects on protein tyrosine phosphatase 1B (PTP1B) activity. Bioorg Med Chem19:3378-83 (2011) 
 
Tyrosine-protein phosphatase non-receptor type 1
Name:Tyrosine-protein phosphatase non-receptor type 1
Type:Protein phosphatase
Mol. Mass.:49963.76
Organism:Homo sapiens (Human)
Description:Human recombinant GST-fusion PTP1B (1-435).
Residue:435
BDBM50241408
NameBDBM50241408
Synonyms:(2S)-liquiritigenin CHEMBL252642 Liquiritigenin
TypeSmall organic molecule
Emp. Form.C15H12O4
Mol. Mass.256.2534
SMILESOc1ccc(cc1)[C@@H]1CC(=O)c2ccc(O)cc2O1