Reaction Details
TargetTyrosine-protein phosphatase non-receptor type 1
LigandBDBM50349931
Substrate/Competitorn/a
Meas. Tech.ChEMBL_762179 (CHEMBL1816250)
IC50 14900±n/a nM
Citation Nguyen, PHDao, TTKim, JPhong, do TNdinteh, DTMbafor, JTOh, WK New 5-deoxyflavonoids and their inhibitory effects on protein tyrosine phosphatase 1B (PTP1B) activity. Bioorg Med Chem19:3378-83 (2011) 
 
Tyrosine-protein phosphatase non-receptor type 1
Name:Tyrosine-protein phosphatase non-receptor type 1
Type:Protein phosphatase
Mol. Mass.:49963.76
Organism:Homo sapiens (Human)
Description:Human recombinant GST-fusion PTP1B (1-435).
Residue:435
BDBM50349931
NameBDBM50349931
Synonyms:CHEMBL1811971
TypeSmall organic molecule
Emp. Form.C21H22O6
Mol. Mass.370.3958
SMILES[#6]-[#8]-c1cc(-[#8])c(cc1-[#6]\[#6]=[#6](\[#6])-[#6])[C@]1([#8])[#6]-[#8]-c2cc(-[#8])ccc2-[#6]1=O