Reaction Details
TargetDNA topoisomerase 2-alpha
LigandBDBM50349932
Substrate/Competitorn/a
Meas. Tech.ChEMBL_761136 (CHEMBL1815165)
IC50 4880±n/a nM
Citation Wu, WBOu, JBHuang, ZHChen, SBOu, TMTan, JHLi, DShen, LLHuang, SLGu, LQHuang, ZS Synthesis and evaluation of mansonone F derivatives as topoisomerase inhibitors. Eur J Med Chem46:3339-47 (2011) 
 
DNA topoisomerase 2-alpha
Name:DNA topoisomerase 2-alpha
Type:Protein
Mol. Mass.:174415.30
Organism:Homo sapiens (Human)
Description:P11388
Residue:1531
BDBM50349932
NameBDBM50349932
Synonyms:CHEMBL1812137
TypeSmall organic molecule
Emp. Form.C19H14O4
Mol. Mass.306.3121
SMILESOC1(Cc2ccccc2)COC2=CC(=O)C(=O)c3cccc1c23