Reaction Details
Target5-hydroxytryptamine receptor 1A
LigandBDBM50349965
Substrate/Competitorn/a
Meas. Tech.ChEMBL_761423 (CHEMBL1817053)
Ki 128±n/a nM
Citation Lewgowd, WBojarski, AJSzczesio, MOlczak, AGlowka, MLMordalski, SStanczak, A Synthesis and structural investigation of some pyrimido[5,4-c]quinolin-4(3H)-one derivatives with a long-chain arylpiperazine moiety as potent 5-HT(1A/2A) and 5-HT(7) receptor ligands. Eur J Med Chem46:3348-61 (2011) 
 
5-hydroxytryptamine receptor 1A
Name:5-hydroxytryptamine receptor 1A
Type:G Protein-Coupled Receptor (GPCR)
Mol. Mass.:46445.29
Organism:Rattus norvegicus (rat)
Description:Binding assays were performed using rat hippocampal membranes.
Residue:422
BDBM50349965
NameBDBM50349965
Synonyms:CHEMBL1812306
TypeSmall organic molecule
Emp. Form.C25H27N5O
Mol. Mass.413.5148
SMILESCc1ccc2ncc3c(ncn(CCCN4CCN(CC4)c4ccccc4)c3=O)c2c1