Reaction Details
Target5-hydroxytryptamine receptor 7
LigandBDBM50349951
Substrate/Competitorn/a
Meas. Tech.ChEMBL_761424 (CHEMBL1817054)
Ki 184±n/a nM
Citation Lewgowd, WBojarski, AJSzczesio, MOlczak, AGlowka, MLMordalski, SStanczak, A Synthesis and structural investigation of some pyrimido[5,4-c]quinolin-4(3H)-one derivatives with a long-chain arylpiperazine moiety as potent 5-HT(1A/2A) and 5-HT(7) receptor ligands. Eur J Med Chem46:3348-61 (2011) 
 
5-hydroxytryptamine receptor 7
Name:5-hydroxytryptamine receptor 7
Type:G Protein-Coupled Receptor (GPCR)
Mol. Mass.:53573.08
Organism:Homo sapiens (Human)
Description:P34969
Residue:479
BDBM50349951
NameBDBM50349951
Synonyms:CHEMBL1812282
TypeSmall organic molecule
Emp. Form.C25H26ClN5O
Mol. Mass.447.96
SMILESClc1cccc(c1)N1CCN(CCCCn2cnc3c4ccccc4ncc3c2=O)CC1