Reaction Details
TargetSodium channel protein type 9 subunit alpha
LigandBDBM50350006
Substrate/Competitorn/a
Meas. Tech.ChEMBL_762090 (CHEMBL1816129)
IC50>10000±n/a nM
Citation Bregman, HBerry, LBuchanan, JLChen, ADu, BFeric, EHierl, MHuang, LImmke, DJanosky, BJohnson, DLi, XLigutti, JLiu, DMalmberg, AMatson, DMcDermott, JMiu, PNguyen, HNPatel, VFWaldon, DWilenkin, BZheng, XMZou, AMcDonough, SIDiMauro, EF Identification of a potent, state-dependent inhibitor of Nav1.7 with oral efficacy in the formalin model of persistent pain. J Med Chem54:4427-45 (2011) 
 
Sodium channel protein type 9 subunit alpha
Name:Sodium channel protein type 9 subunit alpha
Type:Protein
Mol. Mass.:226375.97
Organism:Homo sapiens (Human)
Description:Q15858
Residue:1988
BDBM50350006
NameBDBM50350006
Synonyms:CHEMBL1813030
TypeSmall organic molecule
Emp. Form.C22H23N7O2
Mol. Mass.417.4637
SMILESCC(=O)Nc1cccc(Nc2ncnc(n2)N2CCN(CC2)C(=O)c2ccccc2)c1