Reaction Details
TargetSodium channel protein type 9 subunit alpha
LigandBDBM50017659
Substrate/Competitorn/a
Meas. Tech.ChEMBL_761526 (CHEMBL1817406)
Ki 500±n/a nM
Citation Bregman, HBerry, LBuchanan, JLChen, ADu, BFeric, EHierl, MHuang, LImmke, DJanosky, BJohnson, DLi, XLigutti, JLiu, DMalmberg, AMatson, DMcDermott, JMiu, PNguyen, HNPatel, VFWaldon, DWilenkin, BZheng, XMZou, AMcDonough, SIDiMauro, EF Identification of a potent, state-dependent inhibitor of Nav1.7 with oral efficacy in the formalin model of persistent pain. J Med Chem54:4427-45 (2011) 
 
Sodium channel protein type 9 subunit alpha
Name:Sodium channel protein type 9 subunit alpha
Type:Protein
Mol. Mass.:226375.97
Organism:Homo sapiens (Human)
Description:Q15858
Residue:1988
BDBM50017659
NameBDBM50017659
Synonyms:2-(Dimethylamino)ethyl p-(butylamino)benzoate CHEMBL698 TETRACAINE | p-Butylaminobenzoyl-2-dimethylaminoethanol
TypeSmall organic molecule
Emp. Form.C15H24N2O2
Mol. Mass.264.3633
SMILESCCCCNc1ccc(cc1)C(=O)OCCN(C)C