Reaction Details
TargetSodium channel protein type 9 subunit alpha
LigandBDBM50349991
Substrate/Competitorn/a
Meas. Tech.ChEMBL_762090 (CHEMBL1816129)
IC50 800±n/a nM
Citation Bregman, HBerry, LBuchanan, JLChen, ADu, BFeric, EHierl, MHuang, LImmke, DJanosky, BJohnson, DLi, XLigutti, JLiu, DMalmberg, AMatson, DMcDermott, JMiu, PNguyen, HNPatel, VFWaldon, DWilenkin, BZheng, XMZou, AMcDonough, SIDiMauro, EF Identification of a potent, state-dependent inhibitor of Nav1.7 with oral efficacy in the formalin model of persistent pain. J Med Chem54:4427-45 (2011) 
 
Sodium channel protein type 9 subunit alpha
Name:Sodium channel protein type 9 subunit alpha
Type:Protein
Mol. Mass.:226375.97
Organism:Homo sapiens (Human)
Description:Q15858
Residue:1988
BDBM50349991
NameBDBM50349991
Synonyms:CHEMBL1813051
TypeSmall organic molecule
Emp. Form.C26H28F3N5O3
Mol. Mass.515.5274
SMILESCC(=O)Nc1cccc(Nc2cc(ncn2)N2CCC(CC2)OCc2ccc(OC(F)(F)F)cc2)c1C