Reaction Details
TargetSodium channel protein type 9 subunit alpha
LigandBDBM50349994
Substrate/Competitorn/a
Meas. Tech.ChEMBL_762090 (CHEMBL1816129)
IC50>10000±n/a nM
Citation Bregman, HBerry, LBuchanan, JLChen, ADu, BFeric, EHierl, MHuang, LImmke, DJanosky, BJohnson, DLi, XLigutti, JLiu, DMalmberg, AMatson, DMcDermott, JMiu, PNguyen, HNPatel, VFWaldon, DWilenkin, BZheng, XMZou, AMcDonough, SIDiMauro, EF Identification of a potent, state-dependent inhibitor of Nav1.7 with oral efficacy in the formalin model of persistent pain. J Med Chem54:4427-45 (2011) 
 
Sodium channel protein type 9 subunit alpha
Name:Sodium channel protein type 9 subunit alpha
Type:Protein
Mol. Mass.:226375.97
Organism:Homo sapiens (Human)
Description:Q15858
Residue:1988
BDBM50349994
NameBDBM50349994
Synonyms:CHEMBL1813045
TypeSmall organic molecule
Emp. Form.C28H36N6O2
Mol. Mass.488.6244
SMILESCC(=O)Nc1cccc(Nc2ncnc(n2)N2CCC(CC2)OCc2ccc(cc2)C(C)(C)C)c1C