Reaction Details
TargetHepatocyte growth factor receptor
LigandBDBM50350074
Substrate/Competitorn/a
Meas. Tech.ChEMBL_762122 (CHEMBL1816161)
IC50 68±n/a nM
Citation Zhao, AGao, XWang, YAi, JWang, YChen, YGeng, MZhang, A Discovery of novel c-Met kinase inhibitors bearing a thieno[2,3-d]pyrimidine or furo[2,3-d]pyrimidine scaffold. Bioorg Med Chem19:3906-18 (2011) 
 
Hepatocyte growth factor receptor
Name:Hepatocyte growth factor receptor
Type:Protein
Mol. Mass.:155559.73
Organism:Homo sapiens (Human)
Description:P08581
Residue:1390
BDBM50350074
NameBDBM50350074
Synonyms:CHEMBL1813639
TypeSmall organic molecule
Emp. Form.C30H17F3N4O3S
Mol. Mass.570.541
SMILESFc1ccc(cc1)-c1csc2ncnc(Oc3ccc(NC(=O)c4cccn(-c5ccc(F)cc5)c4=O)cc3F)c12