Reaction Details
TargetKappa-type opioid receptor
LigandBDBM50350091
Substrate/Competitorn/a
Meas. Tech.ChEMBL_760921 (CHEMBL1814859)
IC50 32400±n/a nM
Citation Gao, JLeón, FRadwan, MMDale, ORHusni, ASManly, SPLupien, SWang, XHill, RADugan, FMCutler, HGCutler, SJ Benzyl derivatives with in vitro binding affinity for human opioid and cannabinoid receptors from the fungus Eurotium repens. J Nat Prod74:1636-9 (2011) 
 
Kappa-type opioid receptor
Name:Kappa-type opioid receptor
Type:G Protein-Coupled Receptor (GPCR)
Mol. Mass.:42648.76
Organism:Homo sapiens (Human)
Description:P41145
Residue:380
BDBM50350091
NameBDBM50350091
Synonyms:CHEMBL1813663
TypeSmall organic molecule
Emp. Form.C20H28O3
Mol. Mass.316.4345
SMILES[#6]-[#6]-[#6]-[#6]-[#6]\[#6]=[#6]\c1c2-[#6]-[#6](-[#8])-[#8]-c2c(-[#6]\[#6]=[#6](\[#6])-[#6])cc1-[#8]