Reaction Details
TargetPoly [ADP-ribose] polymerase 1
LigandBDBM50106187
Substrate/Competitorn/a
Meas. Tech.ChEMBL_760968 (CHEMBL1814965)
IC50 5400±n/a nM
Citation Steffen, JDCoyle, DLDamodaran, KBeroza, PJacobson, MK Discovery and structure-activity relationships of modified salicylanilides as cell permeable inhibitors of poly(ADP-ribose) glycohydrolase (PARG). J Med Chem54:5403-13 (2011) 
 
Poly [ADP-ribose] polymerase 1
Name:Poly [ADP-ribose] polymerase 1
Type:n/a
Mol. Mass.:113114.22
Organism:Homo sapiens (Human)
Description:P09874
Residue:1014
BDBM50106187
NameBDBM50106187
Synonyms:Benzenecarboxamide Benzoylamide Phenylcarboxamide benzamide
TypeSmall organic molecule
Emp. Form.C7H7NO
Mol. Mass.121.1366
SMILESNC(=O)c1ccccc1