Reaction Details
TargetAmine oxidase [flavin-containing] A
LigandBDBM29136
Substrate/Competitorn/a
Meas. Tech.ChEMBL_760980 (CHEMBL1815008)
IC50 6560±n/a nM
Citation Gaspar, ASilva, TYáñez, MVina, DOrallo, FOrtuso, FUriarte, EAlcaro, SBorges, F Chromone, a privileged scaffold for the development of monoamine oxidase inhibitors. J Med Chem54:5165-73 (2011) 
 
Amine oxidase [flavin-containing] A
Name:Amine oxidase [flavin-containing] A
Type:Protein
Mol. Mass.:59689.53
Organism:Homo sapiens (Human)
Description:P21397
Residue:527
BDBM29136
NameBDBM29136
Synonyms:CHEMBL92401 Iprazid | Iproniazid
TypeSmall organic molecule
Emp. Form.C9H13N3O
Mol. Mass.179.219
SMILESCC(C)NNC(=O)c1ccncc1