Reaction Details
TargetAmine oxidase [flavin-containing] A
LigandBDBM50350112
Substrate/Competitorn/a
Meas. Tech.ChEMBL_760980 (CHEMBL1815008)
IC50 8340±n/a nM
Citation Gaspar, ASilva, TYáñez, MVina, DOrallo, FOrtuso, FUriarte, EAlcaro, SBorges, F Chromone, a privileged scaffold for the development of monoamine oxidase inhibitors. J Med Chem54:5165-73 (2011) 
 
Amine oxidase [flavin-containing] A
Name:Amine oxidase [flavin-containing] A
Type:Protein
Mol. Mass.:59689.53
Organism:Homo sapiens (Human)
Description:P21397
Residue:527
BDBM50350112
NameBDBM50350112
Synonyms:CHEMBL1814065
TypeSmall organic molecule
Emp. Form.C17H13NO5
Mol. Mass.311.2888
SMILESCOc1ccc(NC(=O)c2coc3ccccc3c2=O)cc1O