Reaction Details
TargetThymidylate synthase
LigandBDBM50350140
Substrate/Competitorn/a
Meas. Tech.ChEMBL_760998 (CHEMBL1815026)
Ki 3000±n/a nM
Citation Mangani, SCancian, LLeone, RPozzi, CLazzari, SLuciani, RFerrari, SCosti, MP Identification of the binding modes of N-phenylphthalimides inhibiting bacterial thymidylate synthase through X-ray crystallography screening. J Med Chem54:5454-67 (2011) 
 
Thymidylate synthase
Name:Thymidylate synthase
Type:Enzyme
Mol. Mass.:36576.54
Organism:Lactobacillus casei
Description:n/a
Residue:316
BDBM50350140
NameBDBM50350140
Synonyms:CHEMBL1814080
TypeSmall organic molecule
Emp. Form.C12H8N2O2S
Mol. Mass.244.269
SMILESCc1cccc2C(=O)N(C(=O)c12)c1nccs1