Reaction Details
TargetCannabinoid receptor 2
LigandBDBM50350164
Substrate/Competitorn/a
Meas. Tech.ChEMBL_761451 (CHEMBL1817172)
Ki 220±n/a nM
Citation Pasquini, SDe Rosa, MPedani, VMugnaini, CGuida, FLuongo, LDe Chiaro, MMaione, SDragoni, SFrosini, MLigresti, ADi Marzo, VCorelli, F Investigations on the 4-quinolone-3-carboxylic acid motif. 4. Identification of new potent and selective ligands for the cannabinoid type 2 receptor with diverse substitution patterns and antihyperalgesic effects in mice. J Med Chem54:5444-53 (2011) 
 
Cannabinoid receptor 2
Name:Cannabinoid receptor 2
Type:G Protein-Coupled Receptor (GPCR)
Mol. Mass.:39690.94
Organism:Homo sapiens (Human)
Description:P34972
Residue:360
BDBM50350164
NameBDBM50350164
Synonyms:CHEMBL1814471
TypeSmall organic molecule
Emp. Form.C26H26N2O2
Mol. Mass.398.4968
SMILESOc1c(cnc2c(cccc12)-c1ccccc1)C(=O)NC12CC3CC(CC(C3)C1)C2