Reaction Details
TargetCannabinoid receptor 2
LigandBDBM50335937
Substrate/Competitorn/a
Meas. Tech.ChEMBL_761451 (CHEMBL1817172)
Ki 0.7±n/a nM
Citation Pasquini, SDe Rosa, MPedani, VMugnaini, CGuida, FLuongo, LDe Chiaro, MMaione, SDragoni, SFrosini, MLigresti, ADi Marzo, VCorelli, F Investigations on the 4-quinolone-3-carboxylic acid motif. 4. Identification of new potent and selective ligands for the cannabinoid type 2 receptor with diverse substitution patterns and antihyperalgesic effects in mice. J Med Chem54:5444-53 (2011) 
 
Cannabinoid receptor 2
Name:Cannabinoid receptor 2
Type:G Protein-Coupled Receptor (GPCR)
Mol. Mass.:39690.94
Organism:Homo sapiens (Human)
Description:P34972
Residue:360
BDBM50335937
NameBDBM50335937
Synonyms:8-Methyl-4-oxo-1-pentyl-1,4-dihydro-quinoline-3-carboxylic acid adamantan-1-ylamide | CHEMBL1668518
TypeSmall organic molecule
Emp. Form.C26H34N2O2
Mol. Mass.406.5604
SMILESCCCCCn1cc(C(=O)NC23CC4CC(CC(C4)C2)C3)c(=O)c2cccc(C)c12