Reaction Details
TargetDipeptidyl peptidase 8
LigandBDBM50350169
Substrate/Competitorn/a
Meas. Tech.ChEMBL_761374 (CHEMBL1816912)
IC50 14±n/a nM
Citation Van Goethem, SMatheeussen, VJoossens, JLambeir, AMChen, XDe Meester, IHaemers, AAugustyns, KVan der Veken, P Structure-activity relationship studies on isoindoline inhibitors of dipeptidyl peptidases 8 and 9 (DPP8, DPP9): is DPP8-selectivity an attainable goal? J Med Chem54:5737-46 (2011) 
 
Dipeptidyl peptidase 8
Name:Dipeptidyl peptidase 8
Type:Enzyme
Mol. Mass.:103342.62
Organism:Homo sapiens (Human)
Description:Q6V1X1
Residue:898
BDBM50350169
NameBDBM50350169
Synonyms:CHEMBL1814633 US11559537, Compound 4160(1G-244)
TypeSmall organic molecule
Emp. Form.C29H30F2N4O2
Mol. Mass.504.5709
SMILESN[C@@H](CC(=O)N1CCN(CC1)C(c1ccc(F)cc1)c1ccc(F)cc1)C(=O)N1Cc2ccccc2C1