Reaction Details
TargetDipeptidyl peptidase 2
LigandBDBM50146972
Substrate/Competitorn/a
Meas. Tech.ChEMBL_761377 (CHEMBL1816915)
IC50 0.48±n/a nM
Citation Van Goethem, SMatheeussen, VJoossens, JLambeir, AMChen, XDe Meester, IHaemers, AAugustyns, KVan der Veken, P Structure-activity relationship studies on isoindoline inhibitors of dipeptidyl peptidases 8 and 9 (DPP8, DPP9): is DPP8-selectivity an attainable goal? J Med Chem54:5737-46 (2011) 
 
Dipeptidyl peptidase 2
Name:Dipeptidyl peptidase 2
Type:Protein
Mol. Mass.:54339.29
Organism:Homo sapiens (Human)
Description:Q9UHL4
Residue:492
BDBM50146972
NameBDBM50146972
Synonyms:(S)-4-(4-chlorobenzylamino)-2-amino-1-(piperidin-1-yl)butan-1-one CHEMBL98869 | N4-(4-chlorobenzyl)-2,4-diaminobutanoylpiperidine
TypeSmall organic molecule
Emp. Form.C16H24ClN3O
Mol. Mass.309.834
SMILESN[C@@H](CCNCc1ccc(Cl)cc1)C(=O)N1CCCCC1