Reaction Details
TargetDipeptidyl peptidase 2
LigandBDBM11162
Substrate/Competitorn/a
Meas. Tech.ChEMBL_761377 (CHEMBL1816915)
IC50>100000±n/a nM
Citation Van Goethem, SMatheeussen, VJoossens, JLambeir, AMChen, XDe Meester, IHaemers, AAugustyns, KVan der Veken, P Structure-activity relationship studies on isoindoline inhibitors of dipeptidyl peptidases 8 and 9 (DPP8, DPP9): is DPP8-selectivity an attainable goal? J Med Chem54:5737-46 (2011) 
 
Dipeptidyl peptidase 2
Name:Dipeptidyl peptidase 2
Type:Protein
Mol. Mass.:54339.29
Organism:Homo sapiens (Human)
Description:Q9UHL4
Residue:492
BDBM11162
NameBDBM11162
Synonyms:(1R)-3-oxo-3-[3-(trifluoroethyl)-5,6-dihydro[1,2,4]triazolo[4,3-a]pyrazin-7(8H)-yl]-1-(2,4,5-trifluorobenzyl)propylamine CHEMBL393336 Sitagliptin Triazolopiperazine Analogue 1 | US10479798, Compound MK0431
TypeSmall organic molecule
Emp. Form.C16H15F6N5O
Mol. Mass.407.3136
SMILESN[C@@H](CC(=O)N1CCn2c(C1)nnc2C(F)(F)F)Cc1cc(F)c(F)cc1F