Reaction Details
TargetDipeptidyl peptidase 2
LigandBDBM11695
Substrate/Competitorn/a
Meas. Tech.ChEMBL_761377 (CHEMBL1816915)
IC50>1000000±n/a nM
Citation Van Goethem, SMatheeussen, VJoossens, JLambeir, AMChen, XDe Meester, IHaemers, AAugustyns, KVan der Veken, P Structure-activity relationship studies on isoindoline inhibitors of dipeptidyl peptidases 8 and 9 (DPP8, DPP9): is DPP8-selectivity an attainable goal? J Med Chem54:5737-46 (2011) 
 
Dipeptidyl peptidase 2
Name:Dipeptidyl peptidase 2
Type:Protein
Mol. Mass.:54339.29
Organism:Homo sapiens (Human)
Description:Q9UHL4
Residue:492
BDBM11695
NameBDBM11695
Synonyms:(2S)-1-{2-[(3-hydroxyadamantan-1-yl)amino]acetyl}pyrrolidine-2-carbonitrile NVP-LAF237
TypeSmall organic molecule
Emp. Form.C17H25N3O2
Mol. Mass.303.3993
SMILESOC12CC3CC(C1)CC(C3)(C2)NCC(=O)N1CCC[C@H]1C#N