Reaction Details
TargetAdenosine kinase
LigandBDBM50350201
Substrate/Competitorn/a
Meas. Tech.ChEMBL_761462 (CHEMBL1817183)
IC50>5000±n/a nM
Citation Bourderioux, ANaus, PPerlíková, PPohl, RPichová, IVotruba, IDzubák, PKonecný, PHajdúch, MStray, KMWang, TRay, ASFeng, JYBirkus, GCihlar, THocek, M Synthesis and significant cytostatic activity of 7-hetaryl-7-deazaadenosines. J Med Chem54:5498-507 (2011) 
 
Adenosine kinase
Name:Adenosine kinase
Type:PROTEIN
Mol. Mass.:40545.97
Organism:Homo sapiens (Human)
Description:ChEMBL_1467841
Residue:362
BDBM50350201
NameBDBM50350201
Synonyms:CHEMBL1814769
TypeSmall organic molecule
Emp. Form.C15H16N4O5
Mol. Mass.332.3113
SMILESNc1ncnc2n(cc(-c3ccoc3)c12)[C@@H]1O[C@H](CO)[C@@H](O)[C@H]1O