Reaction Details
TargetArginase
LigandBDBM50350311
Substrate/Competitorn/a
Meas. Tech.ChEMBL_762138 (CHEMBL1816209)
Ki 10000±n/a nM
Citation Ilies, MDi Costanzo, LDowling, DPThorn, KJChristianson, DW Binding ofa,a-disubstituted amino acids to arginase suggests new avenues for inhibitor design. J Med Chem54:5432-43 (2011) 
 
Arginase
Name:Arginase
Synonyms:n/a
Type:PROTEIN
Mol. Mass.:46502.96
Organism:Plasmodium falciparum
Description:ChEMBL_762136
Residue:411
BDBM50350311
NameBDBM50350311
Synonyms:CHEMBL1812661
TypeSmall organic molecule
Emp. Form.C6H14BNO4
Mol. Mass.174.991
SMILES[NH3+][C@@H](CCCCB(O)O)C([O-])=O