Reaction Details
TargetLiver carboxylesterase 1
LigandBDBM22722
Substrate/Competitorn/a
Meas. Tech.ChEMBL_762143 (CHEMBL1816214)
Ki 103±n/a nM
Citation Parkinson, EIJason Hatfield, MTsurkan, LHyatt, JLEdwards, CCHicks, LDYan, BPotter, PM Requirements for mammalian carboxylesterase inhibition by substituted ethane-1,2-diones. Bioorg Med Chem19:4635-43 (2011) 
 
Liver carboxylesterase 1
Name:Liver carboxylesterase 1
Type:Enzyme
Mol. Mass.:62292
Organism:Oryctolagus cuniculus (rabbit)
Description:n/a
Residue:565
BDBM22722
NameBDBM22722
Synonyms:1,2-diphenylethane-1,2-dione CHEMBL189886 | Diphenylethane-1,2-dione
TypeSmall organic molecule
Emp. Form.C14H10O2
Mol. Mass.210.228
SMILESO=C(C(=O)c1ccccc1)c1ccccc1