Reaction Details
TargetCocaine esterase
LigandBDBM50350329
Substrate/Competitorn/a
Meas. Tech.ChEMBL_762148 (CHEMBL1816219)
Ki 24.5±n/a nM
Citation Parkinson, EIJason Hatfield, MTsurkan, LHyatt, JLEdwards, CCHicks, LDYan, BPotter, PM Requirements for mammalian carboxylesterase inhibition by substituted ethane-1,2-diones. Bioorg Med Chem19:4635-43 (2011) 
 
Cocaine esterase
Name:Cocaine esterase
Type:PROTEIN
Mol. Mass.:61801.08
Organism:Homo sapiens (Human)
Description:ChEMBL_1494240
Residue:559
BDBM50350329
NameBDBM50350329
Synonyms:CHEMBL1812859
TypeSmall organic molecule
Emp. Form.C18H34O2
Mol. Mass.282.4614
SMILESCCCCCCCCC(=O)C(=O)CCCCCCCC