Reaction Details
TargetSmoothened homolog
LigandBDBM50350342
Substrate/Competitorn/a
Meas. Tech.ChEMBL_762249 (CHEMBL1816320)
IC50 22±n/a nM
Citation Kinzel, OAlfieri, AAltamura, SBrunetti, MBufali, SColaceci, FFerrigno, FFilocamo, GFonsi, MGallinari, PMalancona, SHernando, JIMonteagudo, EOrsale, MVPalumbi, MCPucci, VRowley, MSasso, RScarpelli, RSteinkühler, CJones, P Identification of MK-5710 ((8aS)-8a-methyl-1,3-dioxo-2-[(1S,2R)-2-phenylcyclo- propyl]-N-(1-phenyl-1H-pyrazol-5-yl)hexahydro-imidazo[1,5-a]pyrazine-7(1H)-carboxamide), a potent smoothened antagonist for use in Hedgehog pathway dependent malignancies, part 2. Bioorg Med Chem Lett21:4429-35 (2011) 
 
Smoothened homolog
Name:Smoothened homolog
Type:Protein
Mol. Mass.:86415.51
Organism:Homo sapiens (Human)
Description:Q99835
Residue:787
BDBM50350342
NameBDBM50350342
Synonyms:CHEMBL1813114
TypeSmall organic molecule
Emp. Form.C26H26N6O3
Mol. Mass.470.523
SMILESC[C@@]12CN(CCN1C(=O)N([C@H]1C[C@@H]1c1ccccc1)C2=O)C(=O)Nc1ccnn1-c1ccccc1