Reaction Details
TargetProstaglandin D2 receptor
LigandBDBM50350349
Substrate/Competitorn/a
Meas. Tech.ChEMBL_761111 (CHEMBL1815365)
Ki 7.7±n/a nM
Citation Iwahashi, MShimabukuro, AOnoda, TMatsunaga, YOkada, YMatsumoto, RNambu, FNakai, HToda, M Discovery of selective indole-based prostaglandin D2 receptor antagonist. Bioorg Med Chem19:4574-88 (2011) 
 
Prostaglandin D2 receptor
Name:Prostaglandin D2 receptor
Type:PROTEIN
Mol. Mass.:40018.63
Organism:Mus musculus
Description:ChEMBL_788408
Residue:357
BDBM50350349
NameBDBM50350349
Synonyms:CHEMBL1813115
TypeSmall organic molecule
Emp. Form.C28H26N2O5
Mol. Mass.470.5164
SMILESCN1C[C@@H](COc2ccc(cc2)C(=O)n2c(C)c(CC(O)=O)c3ccccc23)Oc2ccccc12