Reaction Details
TargetProstacyclin receptor
LigandBDBM50350377
Substrate/Competitorn/a
Meas. Tech.ChEMBL_761110 (CHEMBL1815364)
Ki 94±n/a nM
Citation Iwahashi, MShimabukuro, AOnoda, TMatsunaga, YOkada, YMatsumoto, RNambu, FNakai, HToda, M Discovery of selective indole-based prostaglandin D2 receptor antagonist. Bioorg Med Chem19:4574-88 (2011) 
 
Prostacyclin receptor
Name:Prostacyclin receptor
Type:G Protein-Coupled Receptor (GPCR)
Mol. Mass.:40968.22
Organism:Homo sapiens (Human)
Description:The membranes prepared from human platelet were used in binding assay.
Residue:386
BDBM50350377
NameBDBM50350377
Synonyms:CHEMBL1813274
TypeSmall organic molecule
Emp. Form.C30H30N2O5
Mol. Mass.498.5696
SMILESCN1C[C@@H](COc2cc(C)c(cc2C)C(=O)n2c(C)c(CC(O)=O)c3ccccc23)Oc2ccccc12