Reaction Details
TargetProstacyclin receptor
LigandBDBM50350354
Substrate/Competitorn/a
Meas. Tech.ChEMBL_761110 (CHEMBL1815364)
Ki 320±n/a nM
Citation Iwahashi, MShimabukuro, AOnoda, TMatsunaga, YOkada, YMatsumoto, RNambu, FNakai, HToda, M Discovery of selective indole-based prostaglandin D2 receptor antagonist. Bioorg Med Chem19:4574-88 (2011) 
 
Prostacyclin receptor
Name:Prostacyclin receptor
Type:G Protein-Coupled Receptor (GPCR)
Mol. Mass.:40968.22
Organism:Homo sapiens (Human)
Description:The membranes prepared from human platelet were used in binding assay.
Residue:386
BDBM50350354
NameBDBM50350354
Synonyms:CHEMBL1813277
TypeSmall organic molecule
Emp. Form.C28H24F2N2O5
Mol. Mass.506.4974
SMILESCN1C[C@@H](COc2ccc(C(=O)n3c(C)c(CC(O)=O)c4cc(F)ccc34)c(F)c2)Oc2ccccc12