Reaction Details
TargetNUAK family SNF1-like kinase 1
LigandBDBM50350424
Substrate/Competitorn/a
Meas. Tech.ChEMBL_762494 (CHEMBL1816864)
IC50 15600±n/a nM
Citation Ebada, SSSchulz, BWray, VTotzke, FKubbutat, MHMüller, WEHamacher, AKassack, MULin, WProksch, P Arthrinins A-D: novel diterpenoids and further constituents from the sponge derived fungus Arthrinium sp. Bioorg Med Chem19:4644-51 (2011) 
 
NUAK family SNF1-like kinase 1
Name:NUAK family SNF1-like kinase 1
Type:PROTEIN
Mol. Mass.:74326.51
Organism:Homo sapiens (Human)
Description:ChEMBL_1451343
Residue:661
BDBM50350424
NameBDBM50350424
Synonyms:CHEMBL454440
TypeSmall organic molecule
Emp. Form.C14H10O6
Mol. Mass.274.2256
SMILESCc1c(O)c(O)cc2oc3cc(O)cc(O)c3c(=O)c12