Reaction Details
TargetSerine/threonine-protein kinase pim-1
LigandBDBM50350424
Substrate/Competitorn/a
Meas. Tech.ChEMBL_762503 (CHEMBL1816873)
IC50 300±n/a nM
Citation Ebada, SSSchulz, BWray, VTotzke, FKubbutat, MHMüller, WEHamacher, AKassack, MULin, WProksch, P Arthrinins A-D: novel diterpenoids and further constituents from the sponge derived fungus Arthrinium sp. Bioorg Med Chem19:4644-51 (2011) 
 
Serine/threonine-protein kinase pim-1
Name:Serine/threonine-protein kinase pim-1
Type:Protein
Mol. Mass.:35681.82
Organism:Homo sapiens (Human)
Description:P11309
Residue:313
BDBM50350424
NameBDBM50350424
Synonyms:CHEMBL454440
TypeSmall organic molecule
Emp. Form.C14H10O6
Mol. Mass.274.2256
SMILESCc1c(O)c(O)cc2oc3cc(O)cc(O)c3c(=O)c12